﻿2026-08-04T03:20:34.9597610Z ##[group]Run bash .github/bench/wrap.sh twohost-cli-b -- cargo test -p spt --test twohost_cli -- --nocapture
2026-08-04T03:20:34.9598235Z [36;1mbash .github/bench/wrap.sh twohost-cli-b -- cargo test -p spt --test twohost_cli -- --nocapture[0m
2026-08-04T03:20:34.9611033Z shell: /usr/bin/bash --noprofile --norc -e -o pipefail {0}
2026-08-04T03:20:34.9611309Z env:
2026-08-04T03:20:34.9611605Z   SPT_CI_TEST_TMP: /home/reavus/actions-runner/_work/_temp/spt-test-tmp-30873007187-1-vMzUxF
2026-08-04T03:20:34.9612053Z   TEMP: /home/reavus/actions-runner/_work/_temp/spt-test-tmp-30873007187-1-vMzUxF
2026-08-04T03:20:34.9612457Z   TMP: /home/reavus/actions-runner/_work/_temp/spt-test-tmp-30873007187-1-vMzUxF
2026-08-04T03:20:34.9612862Z   TMPDIR: /home/reavus/actions-runner/_work/_temp/spt-test-tmp-30873007187-1-vMzUxF
2026-08-04T03:20:34.9613352Z   SPT_TWO_HOST: 1
2026-08-04T03:20:34.9613532Z   SPT_TWO_HOST_ROLE: b
2026-08-04T03:20:34.9613723Z   SPT_TWO_HOST_SECRET: rig-twohost-ci
2026-08-04T03:20:34.9613943Z   SPT_TWO_HOST_WAIT_SECS: 900
2026-08-04T03:20:34.9614166Z ##[endgroup]
2026-08-04T03:20:35.2072921Z    Compiling n0-future v0.3.2
2026-08-04T03:20:35.2121458Z    Compiling rustix v1.1.4
2026-08-04T03:20:35.2180455Z    Compiling backon v1.6.0
2026-08-04T03:20:35.2502972Z    Compiling n0-watcher v0.6.1
2026-08-04T03:20:35.2503686Z    Compiling iroh-dns v0.98.0
2026-08-04T03:20:35.3491184Z    Compiling netwatch v0.16.0
2026-08-04T03:20:35.4770724Z    Compiling iroh-relay v0.98.0
2026-08-04T03:20:35.9266055Z    Compiling portmapper v0.16.0
2026-08-04T03:20:36.6468662Z    Compiling terminal_size v0.4.4
2026-08-04T03:20:36.6469474Z    Compiling tempfile v3.27.0
2026-08-04T03:20:36.6917877Z    Compiling clap_builder v4.6.0
2026-08-04T03:20:36.7949789Z    Compiling spt-test-support v0.53.0 (/home/reavus/actions-runner/_work/spt-bs-core/spt-bs-core/crates/spt-test-support)
2026-08-04T03:20:38.0888518Z    Compiling clap v4.6.1
2026-08-04T03:20:38.5920260Z    Compiling iroh v0.98.2
2026-08-04T03:20:46.3160997Z    Compiling spt-net v0.53.0 (/home/reavus/actions-runner/_work/spt-bs-core/spt-bs-core/crates/spt-net)
2026-08-04T03:20:48.0766002Z    Compiling spt-daemon v0.53.0 (/home/reavus/actions-runner/_work/spt-bs-core/spt-bs-core/crates/spt-daemon)
2026-08-04T03:20:58.3616617Z    Compiling spt v0.53.0 (/home/reavus/actions-runner/_work/spt-bs-core/spt-bs-core/crates/spt)
2026-08-04T03:21:04.7947781Z     Finished `test` profile [unoptimized + debuginfo] target(s) in 29.80s
2026-08-04T03:21:04.8172223Z      Running tests/twohost_cli.rs (target/debug/deps/twohost_cli-4f13f58f34159b05)
2026-08-04T03:21:04.8188904Z 
2026-08-04T03:21:04.8189242Z running 2 tests
2026-08-04T03:21:04.8191104Z test gated_cli_role_a ... ok
2026-08-04T03:21:04.8195595Z GATED role B: node 989b0dbaa74de8e5c747af19c65f49211f08235717e8d322ec082ab0cbfb48ee
2026-08-04T03:21:05.2367705Z MANIFEST_DEAD_KEY:gatedresume: [session.psyche_init] references `{psyche_dir}`, not a fillable key — this role is retired (never spawned); remove the dead reference
2026-08-04T03:21:14.7104783Z GATED role B: ticker session 1 ready
2026-08-04T03:22:04.8190660Z test gated_cli_role_b has been running for over 60 seconds
2026-08-04T03:36:14.7294327Z 
2026-08-04T03:36:14.7295163Z thread 'gated_cli_role_b' (4095787) panicked at crates/spt/tests/twohost_cli.rs:189:5:
2026-08-04T03:36:14.7296093Z never converged on the rig: bring-up: A's target row replicated to B
2026-08-04T03:36:14.7296837Z note: run with `RUST_BACKTRACE=1` environment variable to display a backtrace
2026-08-04T03:36:14.8197922Z test gated_cli_role_b ... FAILED
2026-08-04T03:36:14.8198209Z 
2026-08-04T03:36:14.8198312Z failures:
2026-08-04T03:36:14.8198434Z 
2026-08-04T03:36:14.8198531Z failures:
2026-08-04T03:36:14.8198716Z     gated_cli_role_b
2026-08-04T03:36:14.8198860Z 
2026-08-04T03:36:14.8199218Z test result: FAILED. 1 passed; 1 failed; 0 ignored; 0 measured; 0 filtered out; finished in 910.00s
2026-08-04T03:36:14.8199928Z 
2026-08-04T03:36:14.8203514Z error: test failed, to rerun pass `-p spt --test twohost_cli`
2026-08-04T03:36:14.8434684Z ##[error]Process completed with exit code 101.
